BDBM50178620 CHEMBL361228::trans-N-(4-(4-(2,3-dichlorophenyl)piperazin-1-yl)butyl)-4-phenylcyclohexanecarboxamide
SMILES Clc1cccc(N2CCN(CCCCNC(=O)[C@H]3CC[C@@H](CC3)c3ccccc3)CC2)c1Cl
InChI Key InChIKey=SCZQIQLIELOGMA-YHBQERECSA-N
Data  1 KI
  Tab Delimited (TSV)   2D SDfile   Computed 3D by Vconf -m prep SDfile
Find this compound or compounds like it in BindingDB:
Activity Spreadsheet -- Enzyme Inhibition Constant Data from BindingDB
Found 1 hit for monomerid = 50178620
TargetD(3) dopamine receptor(Homo sapiens (Human))
Università
Curated by ChEMBL
LigandPNGBDBM50178620(CHEMBL361228 | trans-N-(4-(4-(2,3-dichlorophenyl)p...)
Affinity DataKi:  22.8nM. Assay description: Displacement of [3H]spiroperidol from cloned human dopamine receptor D3 in CHO cell membrane
In DepthDetails ArticlePubMed