BDBM50178817 ((1S)-1-{N'-Benzyl-N'-[(2S)-2-hydroxy-2-((1S,2R)-2-hydroxy-indan-1-ylcarbamoyl)-3-phenyl-propyl]-hydrazinocarbonyl}-2-methyl-propyl)-carbamic acid methyl ester::6-AMINO HEXANOIC ACID::CHEMBL197165
SMILES COC(=O)N[C@@H](C(C)C)C(=O)NN(Cc1ccccc1)C[C@@](O)(Cc1ccccc1)C(=O)N[C@@H]1[C@H](O)Cc2ccccc12
InChI Key InChIKey=KEFISYJDRSSULW-GQPDOWDHSA-N
Data  1 KI
PDB links: 1 PDB ID matches this monomer.
  Tab Delimited (TSV)   2D SDfile   Computed 3D by Vconf -m prep SDfile
Find this compound or compounds like it in BindingDB:
Activity Spreadsheet -- Enzyme Inhibition Constant Data from BindingDB
Found 1 hit for monomerid = 50178817
TargetGag-Pol polyprotein [489-587](Human immunodeficiency virus type 1)
Uppsala University
Curated by ChEMBL
LigandPNGBDBM50178817(((1S)-1-{N'-Benzyl-N'-[(2S)-2-hydroxy-2-((1S,2R)-2...)
Affinity DataKi:  9nM. Assay description: Inhibitory activity against HIV1 protease expressed in Escherichia coli in a fluorometric assay