BDBM50178821 ((1S)-1-{N'-Benzyl-N'-[(2R)-2-hydroxy-2-((1S,2R)-2-hydroxy-indan-1-ylcarbamoyl)-3-phenyl-propyl]-hydrazinocarbonyl}-2-methyl-propyl)-carbamic acid benzyl ester::CHEMBL198534
SMILES CC(C)[C@H](NC(=O)OCc1ccccc1)C(=O)NN(Cc1ccccc1)C[C@](O)(Cc1ccccc1)C(=O)N[C@@H]1[C@H](O)Cc2ccccc12
InChI Key InChIKey=OPAJKFGNXKQUPP-ITMBJVNVSA-N
Data  1 KI
  Tab Delimited (TSV)   2D SDfile   Computed 3D by Vconf -m prep SDfile
Find this compound or compounds like it in BindingDB:
Activity Spreadsheet -- Enzyme Inhibition Constant Data from BindingDB
Found 1 hit for monomerid = 50178821
TargetGag-Pol polyprotein [489-587](Human immunodeficiency virus type 1)
Uppsala University
Curated by ChEMBL
LigandPNGBDBM50178821(((1S)-1-{N'-Benzyl-N'-[(2R)-2-hydroxy-2-((1S,2R)-2...)
Affinity DataKi:  870nM. Assay description: Inhibitory activity against HIV1 protease expressed in Escherichia coli in a fluorometric assay
In DepthDetails ArticlePubMed