BDBM50178824 (2S)-2-Benzyl-3-{N-benzyl-N'-[(2S)-2-(3-benzyl-ureido)-3,3-dimethyl-butyryl]-hydrazino}-2-hydroxy-N-((1S,2R)-2-hydroxy-indan-1-yl)-propionamide::CHEMBL370132
SMILES CC(C)(C)[C@H](NC(=O)NCc1ccccc1)C(=O)NN(Cc1ccccc1)C[C@@](O)(Cc1ccccc1)C(=O)N[C@@H]1[C@H](O)Cc2ccccc12
InChI Key InChIKey=UIHOSKBIJUZHAQ-MCGMGUOFSA-N
Data  1 KI
  Tab Delimited (TSV)   2D SDfile   Computed 3D by Vconf -m prep SDfile
Find this compound or compounds like it in BindingDB:
Activity Spreadsheet -- Enzyme Inhibition Constant Data from BindingDB
Found 1 hit for monomerid = 50178824
TargetGag-Pol polyprotein [489-587](Human immunodeficiency virus type 1)
Uppsala University
Curated by ChEMBL
LigandPNGBDBM50178824((2S)-2-Benzyl-3-{N-benzyl-N'-[(2S)-2-(3-benzyl-ure...)
Affinity DataKi:  22nM. Assay description: Inhibitory activity against HIV1 protease expressed in Escherichia coli in a fluorometric assay
In DepthDetails ArticlePubMed