BDBM50179062 4-oxo-2,3,4,5,6,11-hexahydro-1H-5,11-diaza-benzo[a]trindene-8-carboxylic acid::CHEMBL204849
SMILES OC(=O)c1ccc2[nH]c3c4CCCc4c4C(=O)NCc4c3c2c1
InChI Key InChIKey=MRQIYHLHDJXBQK-UHFFFAOYSA-N
Data  1 IC50
  Tab Delimited (TSV)   2D SDfile   Computed 3D by Vconf -m prep SDfile
Find this compound or compounds like it in BindingDB:
Activity Spreadsheet -- Enzyme Inhibition Constant Data from BindingDB
Found 1 hit for monomerid = 50179062
TargetPoly [ADP-ribose] polymerase 1(Homo sapiens (Human))
Cephalon
Curated by ChEMBL
LigandPNGBDBM50179062(4-oxo-2,3,4,5,6,11-hexahydro-1H-5,11-diaza-benzo[a...)
Affinity DataIC50:  80nM. Assay description: Inhibition of recombinant human PARP1
In DepthDetails ArticlePubMed