BDBM50179176 2-((1H-pyrrolo[3,2-c]pyridin-1-yl)methyl)-N-m-tolylbenzamide::CHEMBL202805
SMILES Cc1cccc(NC(=O)c2ccccc2Cn2ccc3cnccc23)c1
InChI Key InChIKey=NDJYMUHSOSYJNC-UHFFFAOYSA-N
Data  2 IC50
  Tab Delimited (TSV)   2D SDfile   Computed 3D by Vconf -m prep SDfile
Find this compound or compounds like it in BindingDB:
Activity Spreadsheet -- Enzyme Inhibition Constant Data from BindingDB
Found 2 hits for monomerid = 50179176
TargetVascular endothelial growth factor receptor 1(Homo sapiens (Human))
Chemical Diversity
Curated by ChEMBL
LigandPNGBDBM50179176(2-((1H-pyrrolo[3,2-c]pyridin-1-yl)methyl)-N-m-toly...)
Affinity DataIC50:  740nM. Assay description: Inhibitory activity against VEGFR-1 using 2 uM ATP by HTRF assay
In DepthDetails ArticlePubMed
TargetVascular endothelial growth factor receptor 2(Homo sapiens (Human))
Chemical Diversity
Curated by ChEMBL
LigandPNGBDBM50179176(2-((1H-pyrrolo[3,2-c]pyridin-1-yl)methyl)-N-m-toly...)
Affinity DataIC50:  470nM. Assay description: Inhibitory activity against VEGFR-2 using 2 uM ATP by HTRF assay
In DepthDetails ArticlePubMed