BDBM50179856 CHEMBL205770::N-(3-chloro-4-(1,1,1,3,3,3-hexafluoro-2-hydroxypropan-2-yl)phenyl)-N-methylbenzenesulfonamide
SMILES CN(c1ccc(c(Cl)c1)C(O)(C(F)(F)F)C(F)(F)F)S(=O)(=O)c1ccccc1
InChI Key InChIKey=BVXYQBNGCHAKSP-UHFFFAOYSA-N
Data  1 EC50
  Tab Delimited (TSV)   2D SDfile   Computed 3D by Vconf -m prep SDfile
Find this compound or compounds like it in BindingDB:
Activity Spreadsheet -- Enzyme Inhibition Constant Data from BindingDB
Found 1 hit for monomerid = 50179856
TargetOxysterols receptor LXR-alpha(Homo sapiens (Human))
Amgen
Curated by ChEMBL
LigandPNGBDBM50179856(CHEMBL205770 | N-(3-chloro-4-(1,1,1,3,3,3-hexafluo...)
Affinity DataEC50: >5.00E+3nM. Assay description: Activity against LXR alpha transiently transfected in HEK293 cells
In DepthDetails ArticlePubMed