BDBM50179867 CHEMBL382792::N-(4-(1,1,1,3,3,3-hexafluoro-2-hydroxypropan-2-yl)phenyl)benzenesulfonamide
SMILES OC(c1ccc(NS(=O)(=O)c2ccccc2)cc1)(C(F)(F)F)C(F)(F)F
InChI Key InChIKey=HTCRJPLMWKJJNZ-UHFFFAOYSA-N
Data  1 IC50  1 EC50
  Tab Delimited (TSV)   2D SDfile   Computed 3D by Vconf -m prep SDfile
Find this compound or compounds like it in BindingDB:
Activity Spreadsheet -- Enzyme Inhibition Constant Data from BindingDB
Found 2 hits for monomerid = 50179867
TargetNuclear receptor ROR-gamma(Homo sapiens (Human))
Genentech
Curated by ChEMBL
LigandPNGBDBM50179867(CHEMBL382792 | N-(4-(1,1,1,3,3,3-hexafluoro-2-hydr...)
Affinity DataIC50: >1.00E+4nM. Assay description: Displacement of [3H2]-25-hydroxycholesterol from N-terminal 6xHis-tagged human RORc ligand binding domain (241 to 486) expressed in bacterial express...
In DepthDetails ArticlePubMed
TargetOxysterols receptor LXR-alpha(Homo sapiens (Human))
Amgen
Curated by ChEMBL
LigandPNGBDBM50179867(CHEMBL382792 | N-(4-(1,1,1,3,3,3-hexafluoro-2-hydr...)
Affinity DataEC50:  4.00E+3nM. Assay description: Activity against LXR alpha transiently transfected in HEK293 cells
In DepthDetails ArticlePubMed