BDBM50180035 CHEMBL199783::N3-(benzyl)-4-oxo-1-pentyl-1,4-dihydroquinoline-3-carboxamide
SMILES CCCCCn1cc(C(=O)NCc2ccccc2)c(=O)c2ccccc12
InChI Key InChIKey=YUJSONAJEJFLQC-UHFFFAOYSA-N
Data  1 KI
  Tab Delimited (TSV)   2D SDfile   Computed 3D by Vconf -m prep SDfile
Find this compound or compounds like it in BindingDB:
Activity Spreadsheet -- Enzyme Inhibition Constant Data from BindingDB
Found 1 hit for monomerid = 50180035
TargetCannabinoid receptor 2(Homo sapiens (Human))
Universit£
Curated by ChEMBL
LigandPNGBDBM50180035(CHEMBL199783 | N3-(benzyl)-4-oxo-1-pentyl-1,4-dihy...)
Affinity DataKi: >1.00E+3nM. Assay description: Displacement of [3H]CP-55940 from human CB2 receptor
In DepthDetails ArticlePubMed