BDBM50180042 CHEMBL200179::N3-(1-naphthyl)-1-butyl-4-oxo-1,4-dihydroquinoline-3-carboxamide
SMILES CCCCn1cc(C(=O)Nc2cccc3ccccc23)c(=O)c2ccccc12
InChI Key InChIKey=PSVQDQDTYIMIFS-UHFFFAOYSA-N
Data  1 KI
  Tab Delimited (TSV)   2D SDfile   Computed 3D by Vconf -m prep SDfile
Find this compound or compounds like it in BindingDB:
Activity Spreadsheet -- Enzyme Inhibition Constant Data from BindingDB
Found 1 hit for monomerid = 50180042
TargetCannabinoid receptor 2(Homo sapiens (Human))
Universit£
Curated by ChEMBL
LigandPNGBDBM50180042(CHEMBL200179 | N3-(1-naphthyl)-1-butyl-4-oxo-1,4-d...)
Affinity DataKi:  455nM. Assay description: Displacement of [3H]CP-55940 from human CB2 receptor
In DepthDetails ArticlePubMed