BDBM50180328 2-(Phenylethylamino)-6-(3-acetamidophenyl)pyrazine::CHEMBL372149
SMILES CC(=O)Nc1cccc(c1)-c1cncc(NCCc2ccccc2)n1
InChI Key InChIKey=KPUDQOJMEHYWFH-UHFFFAOYSA-N
Data  1 IC50
  Tab Delimited (TSV)   2D SDfile   Computed 3D by Vconf -m prep SDfile
Find this compound or compounds like it in BindingDB:
Activity Spreadsheet -- Enzyme Inhibition Constant Data from BindingDB
Found 1 hit for monomerid = 50180328
TargetSerine/threonine-protein kinase B-raf(Homo sapiens (Human))
Institute Of Cancer Research
Curated by ChEMBL
LigandPNGBDBM50180328(2-(Phenylethylamino)-6-(3-acetamidophenyl)pyrazine...)
Affinity DataIC50:  4.50E+4nM. Assay description: Inhibitory activity against human B-RAF
In DepthDetails ArticlePubMed