BDBM50180348 2-(2-Pyridylmethylamino)-6-(3-acetamidophenyl)pyrazine::CHEMBL433992
SMILES CC(=O)Nc1cccc(c1)-c1cncc(NCc2ccccn2)n1
InChI Key InChIKey=KBTGWRVIMPDTFG-UHFFFAOYSA-N
Data  2 IC50
  Tab Delimited (TSV)   2D SDfile   Computed 3D by Vconf -m prep SDfile
Find this compound or compounds like it in BindingDB:
Activity Spreadsheet -- Enzyme Inhibition Constant Data from BindingDB
Found 2 hits for monomerid = 50180348
TargetSerine/threonine-protein kinase B-raf(Homo sapiens (Human))
Institute Of Cancer Research
Curated by ChEMBL
LigandPNGBDBM50180348(2-(2-Pyridylmethylamino)-6-(3-acetamidophenyl)pyra...)
Affinity DataIC50: >1.00E+5nM. Assay description: Inhibitory activity against human B-RAF
In DepthDetails ArticlePubMed
TargetSerine/threonine-protein kinase B-raf(Homo sapiens (Human))
Institute Of Cancer Research
Curated by ChEMBL
LigandPNGBDBM50180348(2-(2-Pyridylmethylamino)-6-(3-acetamidophenyl)pyra...)
Affinity DataIC50: >1.00E+5nM. Assay description: Growth inhibition in human melanoma cells WM266.4 expressing mutant B-RAF with SRB
In DepthDetails ArticlePubMed