BDBM50180382 7-(trifluoromethyl)-3-(6-(trifluoromethyl)pyridin-2-yl)imidazo[1,2-a]pyrimidine::CHEMBL203769
SMILES FC(F)(F)c1cccc(n1)-c1cnc2nc(ccn12)C(F)(F)F
InChI Key InChIKey=QIWRIQRYIRGJCG-UHFFFAOYSA-N
Data  2 KI
  Tab Delimited (TSV)   2D SDfile   Computed 3D by Vconf -m prep SDfile
Find this compound or compounds like it in BindingDB:
Activity Spreadsheet -- Enzyme Inhibition Constant Data from BindingDB
Found 2 hits for monomerid = 50180382
TargetGamma-aminobutyric acid receptor subunit alpha-1/beta-3/gamma-2(Homo sapiens (Human))
Merck Sharp And Dohme Research Laboratories
Curated by ChEMBL
LigandPNGBDBM50180382(7-(trifluoromethyl)-3-(6-(trifluoromethyl)pyridin-...)
Affinity DataKi:  0.310nM. Assay description: Displacement of [3H]Ro 15-1788 from recombinant human GABA-Aalpha1 receptor plus beta3gamma2 expressed in L(tk-) cells
Target InfoGoogleScholar
In DepthDetails ArticlePubMed
TargetGamma-aminobutyric acid receptor subunit alpha-3/beta-3/gamma-2(Homo sapiens (Human))
Merck Sharp And Dohme Research Laboratories
Curated by ChEMBL
LigandPNGBDBM50180382(7-(trifluoromethyl)-3-(6-(trifluoromethyl)pyridin-...)
Affinity DataKi:  0.880nM. Assay description: Displacement of [3H]Ro 15-1788 from recombinant human GABA-Aalpha3 receptor plus beta3gamma2 expressed in L(tk-) cells
In DepthDetails ArticlePubMed