BDBM50180632 CHEMBL3813998
SMILES COc1cc(NC(=O)CSc2nc3ccccc3c(=O)n2CCc2ccccn2)cc(OC)c1OC
InChI Key InChIKey=YNMXZGHQHZPKPB-UHFFFAOYSA-N
Data  2 IC50
  Tab Delimited (TSV)   2D SDfile   Computed 3D by Vconf -m prep SDfile
Find this compound or compounds like it in BindingDB:
Activity Spreadsheet -- Enzyme Inhibition Constant Data from BindingDB
Found 2 hits for monomerid = 50180632
TargetProstaglandin G/H synthase 2(Ovis aries (Sheep))
King Saud University
Curated by ChEMBL
LigandPNGBDBM50180632(CHEMBL3813998)
Affinity DataIC50:  400nM. Assay description: Inhibition of ovine COX2 using arachidonic acid as substrate preincubated for 5 mins followed by substrate addition by ELISA
In DepthDetails ArticlePubMed
TargetProstaglandin G/H synthase 1(Ovis aries (Sheep))
King Saud University
Curated by ChEMBL
LigandPNGBDBM50180632(CHEMBL3813998)
Affinity DataIC50: >1.00E+5nM. Assay description: Inhibition of ovine COX1 using arachidonic acid as substrate preincubated for 5 mins followed by substrate addition by ELISA
In DepthDetails ArticlePubMed