BDBM501807 4-[6-(4-aminopiperidyl)-4-(3- methoxypropyl)-3(4- methylphenyl)-5-oxo(4- hydropyrazin-2-yl))-2- fluorobenzenecarbonitrile::US11028066, Example 45
SMILES COCCCn1c(-c2ccc(C)cc2)c(nc(N2CCC(N)CC2)c1=O)-c1ccc(C#N)c(F)c1
InChI Key InChIKey=QGMXEWBICOGTHW-UHFFFAOYSA-N
Data  1 IC50
  Tab Delimited (TSV)   2D SDfile   Computed 3D by Vconf -m prep SDfile
Find this compound or compounds like it in BindingDB:
Activity Spreadsheet -- Enzyme Inhibition Constant Data from BindingDB
Found 1 hit for monomerid = 501807
TargetLysine-specific histone demethylase 1A(Homo sapiens (Human))
Celgene Quanticel Research
US Patent
LigandPNGBDBM501807(4-[6-(4-aminopiperidyl)-4-(3- methoxypropyl)-3(4-...)
Affinity DataIC50: <100nM. Assay description: The enzymatic assay of LSD1 activity is based on Time Resolved-Fluorescence Resonance Energy Transfer (TR-FRET) detection. The inhibitory properties ...
Ligand InfoPC cidPC sid
In DepthDetails US Patent