BDBM50181091 1-(2-cyclopropyl-6-(cyclopropylamino)-5-methylpyrimidin-4-yl)piperidin-4-ol::CHEMBL205582
SMILES Cc1c(NC2CC2)nc(nc1N1CCC(O)CC1)C1CC1
InChI Key InChIKey=LAQMMOXBFGQUFY-UHFFFAOYSA-N
Data  1 KI
  Tab Delimited (TSV)   2D SDfile   Computed 3D by Vconf -m prep SDfile
Find this compound or compounds like it in BindingDB:
Activity Spreadsheet -- Enzyme Inhibition Constant Data from BindingDB
Found 1 hit for monomerid = 50181091
TargetMuscarinic acetylcholine receptor M3(Homo sapiens (Human))
Ucb Pharma
Curated by ChEMBL
LigandPNGBDBM50181091(1-(2-cyclopropyl-6-(cyclopropylamino)-5-methylpyri...)
Affinity DataKi:  501nM. Assay description: Displacement of [3H]methylscopolamine from recombinant human muscarinic M3 receptors expressed in CHO cells
In DepthDetails ArticlePubMed