BDBM50181197 5-(4-(4-(methylsulfonyl)benzylamino)phenyl)-6-ethyl-N4,N4-dimethylpyrimidine-2,4-diamine::CHEMBL381159
SMILES CCc1nc(N)nc(N(C)C)c1-c1ccc(NCc2ccc(cc2)S(C)(=O)=O)cc1
InChI Key InChIKey=DLZDAXDOMHVHHV-UHFFFAOYSA-N
Data  2 IC50
  Tab Delimited (TSV)   2D SDfile   Computed 3D by Vconf -m prep SDfile
Find this compound or compounds like it in BindingDB:
Activity Spreadsheet -- Enzyme Inhibition Constant Data from BindingDB
Found 2 hits for monomerid = 50181197
TargetGrowth hormone secretagogue receptor type 1(Homo sapiens (Human))
Abbott Laboratories
Curated by ChEMBL
LigandPNGBDBM50181197(5-(4-(4-(methylsulfonyl)benzylamino)phenyl)-6-ethy...)
Affinity DataIC50:  192nM. Assay description: Inhibition of human GHS receptor by binding assay
In DepthDetails ArticlePubMed
TargetGrowth hormone secretagogue receptor type 1(Homo sapiens (Human))
Abbott Laboratories
Curated by ChEMBL
LigandPNGBDBM50181197(5-(4-(4-(methylsulfonyl)benzylamino)phenyl)-6-ethy...)
Affinity DataIC50:  772nM. Assay description: Inhibition of human GHS receptor by FLIPR
In DepthDetails ArticlePubMed