BDBM50181224 5-(4-(4-(methylsulfonyl)benzylamino)phenyl)-6-cyclohexylpyrimidine-2,4-diamine::CHEMBL205294
SMILES CS(=O)(=O)c1ccc(CNc2ccc(cc2)-c2c(N)nc(N)nc2C2CCCCC2)cc1
InChI Key InChIKey=WZXZLPJHIZMBJW-UHFFFAOYSA-N
Data  1 IC50
  Tab Delimited (TSV)   2D SDfile   Computed 3D by Vconf -m prep SDfile
Find this compound or compounds like it in BindingDB:
Activity Spreadsheet -- Enzyme Inhibition Constant Data from BindingDB
Found 1 hit for monomerid = 50181224
TargetGrowth hormone secretagogue receptor type 1(Homo sapiens (Human))
Abbott Laboratories
Curated by ChEMBL
LigandPNGBDBM50181224(5-(4-(4-(methylsulfonyl)benzylamino)phenyl)-6-cycl...)
Affinity DataIC50:  36nM. Assay description: Inhibition of human GHS receptor by FLIPR
In DepthDetails ArticlePubMed