BDBM50181226 CHEMBL383766::exo-5-(4-(4-(methylsulfonyl)benzylamino)phenyl)-6-((2S)-bicyclo[2.2.1]hept-5-en-2-yl)pyrimidine-2,4-diamine
SMILES CS(=O)(=O)c1ccc(CNc2ccc(cc2)-c2c(N)nc(N)nc2[C@H]2CC3CC2C=C3)cc1
InChI Key InChIKey=QRYNIQQRBVXXSN-IAYYMHMVSA-N
Data  1 IC50
  Tab Delimited (TSV)   2D SDfile   Computed 3D by Vconf -m prep SDfile
Find this compound or compounds like it in BindingDB:
Activity Spreadsheet -- Enzyme Inhibition Constant Data from BindingDB
Found 1 hit for monomerid = 50181226
TargetGrowth hormone secretagogue receptor type 1(Homo sapiens (Human))
Abbott Laboratories
Curated by ChEMBL
LigandPNGBDBM50181226(CHEMBL383766 | exo-5-(4-(4-(methylsulfonyl)benzyla...)
Affinity DataIC50:  66nM. Assay description: Inhibition of human GHS receptor by FLIPR
In DepthDetails ArticlePubMed