BDBM50181227 5-(4-(4-(methylsulfonyl)benzylamino)phenyl)-6-((3,4-dihydroisoquinolin-2(1H)-yl)methyl)pyrimidine-2,4-diamine::CHEMBL379887
SMILES CS(=O)(=O)c1ccc(CNc2ccc(cc2)-c2c(N)nc(N)nc2CN2CCc3ccccc3C2)cc1
InChI Key InChIKey=ZWQVPYSLJDIXJY-UHFFFAOYSA-N
Data  1 IC50
  Tab Delimited (TSV)   2D SDfile   Computed 3D by Vconf -m prep SDfile
Find this compound or compounds like it in BindingDB:
Activity Spreadsheet -- Enzyme Inhibition Constant Data from BindingDB
Found 1 hit for monomerid = 50181227
TargetGrowth hormone secretagogue receptor type 1(Homo sapiens (Human))
Abbott Laboratories
Curated by ChEMBL
LigandPNGBDBM50181227(5-(4-(4-(methylsulfonyl)benzylamino)phenyl)-6-((3,...)
Affinity DataIC50:  41nM. Assay description: Inhibition of human GHS receptor by FLIPR
In DepthDetails ArticlePubMed