BDBM50181230 5-(4-(4-(methylsulfonyl)benzylamino)phenyl)-6-(bicyclo[2.2.1]heptan-2-yl)pyrimidine-2,4-diamine::CHEMBL203019
SMILES CS(=O)(=O)c1ccc(CNc2ccc(cc2)-c2c(N)nc(N)nc2C2CC3CCC2C3)cc1
InChI Key InChIKey=YPUKHYLHEUJWGC-UHFFFAOYSA-N
Data  1 IC50
  Tab Delimited (TSV)   2D SDfile   Computed 3D by Vconf -m prep SDfile
Find this compound or compounds like it in BindingDB:
Activity Spreadsheet -- Enzyme Inhibition Constant Data from BindingDB
Found 1 hit for monomerid = 50181230
TargetGrowth hormone secretagogue receptor type 1(Homo sapiens (Human))
Abbott Laboratories
Curated by ChEMBL
LigandPNGBDBM50181230(5-(4-(4-(methylsulfonyl)benzylamino)phenyl)-6-(bic...)
Affinity DataIC50:  137nM. Assay description: Inhibition of human GHS receptor by FLIPR
In DepthDetails ArticlePubMed