BDBM50181694 5-(4-chloro-3-fluorobenzylidene)-3-(benzenesulfonylamino)-4-oxo-2-thionothiazolidine::CHEMBL372836
SMILES Fc1cc(C=C2SC(=S)N(NS(=O)(=O)c3ccccc3)C2=O)ccc1Cl
InChI Key InChIKey=UNAWJPJOWNPDTG-UHFFFAOYSA-N
Data  1 IC50
  Tab Delimited (TSV)   2D SDfile   Computed 3D by Vconf -m prep SDfile
Find this compound or compounds like it in BindingDB:
Activity Spreadsheet -- Enzyme Inhibition Constant Data from BindingDB
Found 1 hit for monomerid = 50181694
TargetRNA-directed RNA polymerase(Hepatitis C virus)
Amgen
Curated by ChEMBL
LigandPNGBDBM50181694(5-(4-chloro-3-fluorobenzylidene)-3-(benzenesulfony...)
Affinity DataIC50:  1.00E+3nM. Assay description: Inhibitory activity against HCV delta 21 NS5b RNA polymerase
In DepthDetails ArticlePubMed