BDBM50181702 5-(3-pyridylmethylene)-3-(benzenesulfonylamino)-4-oxo-2-thionothiazolidine::CHEMBL197649
SMILES O=C1N(NS(=O)(=O)c2ccccc2)C(=S)SC1=Cc1cccnc1
InChI Key InChIKey=XIXDZWZPDINDFE-UHFFFAOYSA-N
Data  1 IC50
  Tab Delimited (TSV)   2D SDfile   Computed 3D by Vconf -m prep SDfile
Find this compound or compounds like it in BindingDB:
Activity Spreadsheet -- Enzyme Inhibition Constant Data from BindingDB
Found 1 hit for monomerid = 50181702
TargetRNA-directed RNA polymerase(Hepatitis C virus)
Amgen
Curated by ChEMBL
LigandPNGBDBM50181702(5-(3-pyridylmethylene)-3-(benzenesulfonylamino)-4-...)
Affinity DataIC50:  1.50E+4nM. Assay description: Inhibitory activity against HCV delta 21 NS5b RNA polymerase
In DepthDetails ArticlePubMed