BDBM50181759 4-(3,5-difluorophenylethynyl)-2-methylthiazole::CHEMBL202436
SMILES Cc1nc(cs1)C#Cc1cc(F)cc(F)c1
InChI Key InChIKey=RIXDIVBFRYYMRM-UHFFFAOYSA-N
Data  1 IC50
  Tab Delimited (TSV)   2D SDfile   Computed 3D by Vconf -m prep SDfile
Find this compound or compounds like it in BindingDB:
Activity Spreadsheet -- Enzyme Inhibition Constant Data from BindingDB
Found 1 hit for monomerid = 50181759
TargetMetabotropic glutamate receptor 5(Homo sapiens (Human))
University Of Illinois At Chicago
Curated by ChEMBL
LigandPNGBDBM50181759(4-(3,5-difluorophenylethynyl)-2-methylthiazole | C...)
Affinity DataIC50:  25.3nM. Assay description: Activity in agonist-induced phosphoinositide hydrolysis in CHO cells expressing mGluR5a
In DepthDetails ArticlePubMed