BDBM50181858 8-methoxy-4-methyl-7-(2-oxocyclohexyloxy)-2H-chromen-2-one::CHEMBL201199
SMILES COc1c(OC2CCCCC2=O)ccc2c(C)cc(=O)oc12
InChI Key InChIKey=LPPHCEWGXVOJEM-UHFFFAOYSA-N
Data  2 IC50
  Tab Delimited (TSV)   2D SDfile   Computed 3D by Vconf -m prep SDfile
Find this compound or compounds like it in BindingDB:
Activity Spreadsheet -- Enzyme Inhibition Constant Data from BindingDB
Found 2 hits for monomerid = 50181858
TargetAmine oxidase [flavin-containing] A(Homo sapiens (Human))
University Of Santiago De Compostela
Curated by ChEMBL
LigandPNGBDBM50181858(8-methoxy-4-methyl-7-(2-oxocyclohexyloxy)-2H-chrom...)
Affinity DataIC50:  1.55E+4nM. Assay description: Inhibition of human recombinant MAOA by fluorimetric method
In DepthDetails ArticlePubMed
TargetAmine oxidase [flavin-containing] A(Homo sapiens (Human))
University Of Santiago De Compostela
Curated by ChEMBL
LigandPNGBDBM50181858(8-methoxy-4-methyl-7-(2-oxocyclohexyloxy)-2H-chrom...)
Affinity DataIC50:  1.11E+4nM. Assay description: Inhibition of MAO-A activity
In DepthDetails ArticlePubMed