BDBM50182119 4-(1-(3-(3-(4-(trifluoromethyl)phenyl)-4,5,6,7-tetrahydropyrazolo[4,3-c]pyridin-1-yl)propyl)piperidin-4-yl)-2H-benzo[b][1,4]oxazin-3(4H)-one::CHEMBL205631
SMILES FC(F)(F)c1ccc(cc1)-c1nn(CCCN2CCC(CC2)N2C(=O)COc3ccccc23)c2CCNCc12
InChI Key InChIKey=NGIKJKVCHFIMFL-UHFFFAOYSA-N
Data  1 IC50
  Tab Delimited (TSV)   2D SDfile   Computed 3D by Vconf -m prep SDfile
Find this compound or compounds like it in BindingDB:
Activity Spreadsheet -- Enzyme Inhibition Constant Data from BindingDB
Found 1 hit for monomerid = 50182119
TargetCathepsin S(Homo sapiens (Human))
Johnson And Johnson Pharmaceutical Research And Development
Curated by ChEMBL
LigandPNGBDBM50182119(4-(1-(3-(3-(4-(trifluoromethyl)phenyl)-4,5,6,7-tet...)
Affinity DataIC50:  1.80E+3nM. Assay description: Inhibition of cathepsin S
In DepthDetails ArticlePubMed