BDBM501822 4-[6-(4-amino-piperidin-1-yl)-4- methyl-3-(1-methyl-1H- benzoimidazol-5-yl)-5-oxo-4,5- dihydro-pyrazin-2-yl]-2-fluoro- benzonitrile::US11028066, Example 60
SMILES Cn1cnc2cc(ccc12)-c1c(nc(N2CCC(N)CC2)c(=O)n1C)-c1ccc(C#N)c(F)c1
InChI Key InChIKey=MUROFMNJLXQSBO-UHFFFAOYSA-N
Data  1 IC50
  Tab Delimited (TSV)   2D SDfile   Computed 3D by Vconf -m prep SDfile
Find this compound or compounds like it in BindingDB:
Activity Spreadsheet -- Enzyme Inhibition Constant Data from BindingDB
Found 1 hit for monomerid = 501822
TargetLysine-specific histone demethylase 1A(Homo sapiens (Human))
Celgene Quanticel Research
US Patent
LigandPNGBDBM501822(4-[6-(4-amino-piperidin-1-yl)-4- methyl-3-(1-meth...)
Affinity DataIC50: <100nM. Assay description: The enzymatic assay of LSD1 activity is based on Time Resolved-Fluorescence Resonance Energy Transfer (TR-FRET) detection. The inhibitory properties ...
Ligand InfoPC cidPC sid
In DepthDetails US Patent