BDBM50182356 4-(7-((dimethylamino)methyl)-2-(4-fluorophenyl)H-imidazo[1,2-a]pyridin-3-yl)-N-methylpyrimidin-2-amine::CHEMBL204943
SMILES CNc1nccc(n1)-c1c(nc2cc(CN(C)C)ccn12)-c1ccc(F)cc1
InChI Key InChIKey=BAWQKVHSJHWTRC-UHFFFAOYSA-N
Data  1 IC50
  Tab Delimited (TSV)   2D SDfile   Computed 3D by Vconf -m prep SDfile
Find this compound or compounds like it in BindingDB:
Activity Spreadsheet -- Enzyme Inhibition Constant Data from BindingDB
Found 1 hit for monomerid = 50182356
TargetcGMP-dependent protein kinase(Eimeria tenella)
Merck Research Laboratories
Curated by ChEMBL
LigandPNGBDBM50182356(4-(7-((dimethylamino)methyl)-2-(4-fluorophenyl)H-i...)
Affinity DataIC50:  0.170nM. Assay description: Inhibitory activity against PKG
In DepthDetails ArticlePubMed