BDBM50182368 (2-(4-fluorophenyl)-3-(pyrimidin-4-yl)H-imidazo[1,2-a]pyridin-7-yl)-N,N-dimethylmethanamine::CHEMBL208161
SMILES CN(C)Cc1ccn2c(c(nc2c1)-c1ccc(F)cc1)-c1ccncn1
InChI Key InChIKey=SHEWZMZBEABHCY-UHFFFAOYSA-N
Data  1 IC50
  Tab Delimited (TSV)   2D SDfile   Computed 3D by Vconf -m prep SDfile
Find this compound or compounds like it in BindingDB:
Activity Spreadsheet -- Enzyme Inhibition Constant Data from BindingDB
Found 1 hit for monomerid = 50182368
TargetcGMP-dependent protein kinase(Eimeria tenella)
Merck Research Laboratories
Curated by ChEMBL
LigandPNGBDBM50182368((2-(4-fluorophenyl)-3-(pyrimidin-4-yl)H-imidazo[1,...)
Affinity DataIC50:  1.90nM. Assay description: Inhibitory activity against PKG
In DepthDetails ArticlePubMed