BDBM50182874 3-(pyridin-4-yl)-1H-indol-6-amine::CHEMBL207612
SMILES Nc1ccc2c(c[nH]c2c1)-c1ccncc1
InChI Key InChIKey=NUDVKMUJCFEKEL-UHFFFAOYSA-N
Data  1 IC50
  Tab Delimited (TSV)   2D SDfile   Computed 3D by Vconf -m prep SDfile
Find this compound or compounds like it in BindingDB:
Activity Spreadsheet -- Enzyme Inhibition Constant Data from BindingDB
Found 1 hit for monomerid = 50182874
TargetInosine-5'-monophosphate dehydrogenase 2(Homo sapiens (Human))
Ucb Pharma
Curated by ChEMBL
LigandPNGBDBM50182874(3-(pyridin-4-yl)-1H-indol-6-amine | CHEMBL207612)
Affinity DataIC50:  637nM. Assay description: Inhibition of IMPDH2
In DepthDetails ArticlePubMed