BDBM501833 (S)-5-(2-(4-ethylphenyl)-1- methyl-6-oxo-5-(pyrrolidin-3- ylmethylamino)-1,6- dihydropyridin-3-yl)picolinonitrile::US11028066, Example 71
SMILES CCc1ccc(cc1)-c1c(cc(NC[C@H]2CCNC2)c(=O)n1C)-c1ccc(nc1)C#N
InChI Key InChIKey=JOUZXIAFDLNIAR-SFHVURJKSA-N
Data  1 IC50
  Tab Delimited (TSV)   2D SDfile   Computed 3D by Vconf -m prep SDfile
Find this compound or compounds like it in BindingDB:
Activity Spreadsheet -- Enzyme Inhibition Constant Data from BindingDB
Found 1 hit for monomerid = 501833
TargetLysine-specific histone demethylase 1A(Homo sapiens (Human))
Celgene Quanticel Research
US Patent
LigandPNGBDBM501833((S)-5-(2-(4-ethylphenyl)-1- methyl-6-oxo-5-(pyrro...)
Affinity DataIC50: <100nM. Assay description: The enzymatic assay of LSD1 activity is based on Time Resolved-Fluorescence Resonance Energy Transfer (TR-FRET) detection. The inhibitory properties ...
Ligand InfoPC cidPC sid
In DepthDetails US Patent