BDBM50183359 4-(2,6-dimethylmorpholino)-6-(ethylthio)-1-styryl-1H-pyrazolo[3,4-d]pyrimidine::CHEMBL203866
SMILES CCSc1nc(N2CC(C)OC(C)C2)c2cnn(\C=C/c3ccccc3)c2n1
InChI Key InChIKey=JVEKUVQBABZCQA-KHPPLWFESA-N
Data  1 KI
  Tab Delimited (TSV)   2D SDfile   Computed 3D by Vconf -m prep SDfile
Find this compound or compounds like it in BindingDB:
Activity Spreadsheet -- Enzyme Inhibition Constant Data from BindingDB
Found 1 hit for monomerid = 50183359
TargetProto-oncogene tyrosine-protein kinase Src(Homo sapiens (Human))
Università
Curated by ChEMBL
LigandPNGBDBM50183359(4-(2,6-dimethylmorpholino)-6-(ethylthio)-1-styryl-...)
Affinity DataKi:  2.30E+4nM. Assay description: Inhibitory activity against Src in cell free assay
In DepthDetails ArticlePubMed