BDBM50183370 CHEMBL381279::N-cyclopropyl-1-styryl-1H-pyrazolo[3,4-d]pyrimidin-4-amine
SMILES C1CC1Nc1ncnc2n(\C=C/c3ccccc3)ncc12
InChI Key InChIKey=JBSVVZQXACHBJA-HJWRWDBZSA-N
Data  1 KI
  Tab Delimited (TSV)   2D SDfile   Computed 3D by Vconf -m prep SDfile
Find this compound or compounds like it in BindingDB:
Activity Spreadsheet -- Enzyme Inhibition Constant Data from BindingDB
Found 1 hit for monomerid = 50183370
TargetProto-oncogene tyrosine-protein kinase Src(Homo sapiens (Human))
Università
Curated by ChEMBL
LigandPNGBDBM50183370(CHEMBL381279 | N-cyclopropyl-1-styryl-1H-pyrazolo[...)
Affinity DataKi:  9.20E+3nM. Assay description: Inhibitory activity against Src in cell free assay
In DepthDetails ArticlePubMed