BDBM50183434 CHEMBL379915::cyclo-(CH2-CO-Adi-Leu-Tyr-Ac6c-Asn-Ava-Cys (O))-amide(R)
SMILES CC(C)C[C@@H]1NC(=O)[C@H](CCCC(O)=O)NC(=O)CS(=O)C[C@H](NC(=O)CCCCNC(=O)[C@H](CC(N)=O)NC(=O)C2(CCCCC2)NC(=O)[C@H](Cc2ccc(O)cc2)NC1=O)C(N)=O
InChI Key InChIKey=YNWUNFGKJHUKJS-RLESCGPSSA-N
Data  1 IC50
  Tab Delimited (TSV)   2D SDfile   Computed 3D by Vconf -m prep SDfile
Find this compound or compounds like it in BindingDB:
Activity Spreadsheet -- Enzyme Inhibition Constant Data from BindingDB
Found 1 hit for monomerid = 50183434
TargetGrowth factor receptor-bound protein 2(Homo sapiens (Human))
Graduate School Of The Chinese Academy Of Sciences
Curated by ChEMBL
LigandPNGBDBM50183434(CHEMBL379915 | cyclo-(CH2-CO-Adi-Leu-Tyr-Ac6c-Asn-...)
Affinity DataIC50:  7.70E+4nM. Assay description: Inhibition of recombinant GRB2-SH2 domain
In DepthDetails ArticlePubMed