BDBM50183487 2-[3-({[(2-chlorobenzyl)oxy]carbonyl}amino)-2-thienyl]-5,6-dihydroxypyrimidine-4-carboxylic acid::CHEMBL206518
SMILES OC(=O)c1nc([nH]c(=O)c1O)-c1sccc1NC(=O)OCc1ccccc1Cl
InChI Key InChIKey=CTSDAFQZVIAMGB-UHFFFAOYSA-N
Data  2 IC50  1 EC50
  Tab Delimited (TSV)   2D SDfile   Computed 3D by Vconf -m prep SDfile
Find this compound or compounds like it in BindingDB:
Activity Spreadsheet -- Enzyme Inhibition Constant Data from BindingDB
Found 3 hits for monomerid = 50183487
TargetRNA-directed RNA polymerase(Hepatitis C virus)
P. Angeletti S.P.A. (Merck Research Laboratories)
Curated by ChEMBL
LigandPNGBDBM50183487(2-[3-({[(2-chlorobenzyl)oxy]carbonyl}amino)-2-thie...)
Affinity DataIC50:  340nM. Assay description: Inhibitory activity against HCV 1b BK NS5B deltaC55-R158M mutant RNA polymerase
In DepthDetails ArticlePubMed
TargetRNA-directed RNA polymerase(Hepatitis C virus)
P. Angeletti S.P.A. (Merck Research Laboratories)
Curated by ChEMBL
LigandPNGBDBM50183487(2-[3-({[(2-chlorobenzyl)oxy]carbonyl}amino)-2-thie...)
Affinity DataIC50:  900nM. Assay description: Inhibitory activity against HCV 1b BK NS5B deltaC55-R158K mutant RNA polymerase
In DepthDetails ArticlePubMed
TargetRNA-directed RNA polymerase(Hepatitis C virus)
P. Angeletti S.P.A. (Merck Research Laboratories)
Curated by ChEMBL
LigandPNGBDBM50183487(2-[3-({[(2-chlorobenzyl)oxy]carbonyl}amino)-2-thie...)
Affinity DataEC50:  3.15E+4nM. Assay description: Inhibitory activity against HCV 1b BK NS5B deltaC55 RNA polymerase
In DepthDetails ArticlePubMed