BDBM50183489 (3-amino-2-thienyl)-5,6-dihydroxypyrimidine-4-carboxylic acid::CHEMBL204122
SMILES Nc1ccsc1-c1nc(C(O)=O)c(O)c(=O)[nH]1
InChI Key InChIKey=ZXUFBQXIBIKPTE-UHFFFAOYSA-N
Data  1 IC50
  Tab Delimited (TSV)   2D SDfile   Computed 3D by Vconf -m prep SDfile
Find this compound or compounds like it in BindingDB:
Activity Spreadsheet -- Enzyme Inhibition Constant Data from BindingDB
Found 1 hit for monomerid = 50183489
TargetRNA-directed RNA polymerase(Hepatitis C virus)
P. Angeletti S.P.A. (Merck Research Laboratories)
Curated by ChEMBL
LigandPNGBDBM50183489((3-amino-2-thienyl)-5,6-dihydroxypyrimidine-4-carb...)
Affinity DataIC50:  1.90E+3nM. Assay description: Inhibitory activity against HCV 1b BK NS5B deltaC55 RNA polymerase
In DepthDetails ArticlePubMed