BDBM50183496 5,6-dihydroxy-2-{3-[(1H-indol-3-ylacetyl)amino]-2-thienyl}-pyrimidine-4-carboxylic acid::CHEMBL203729
SMILES OC(=O)c1nc([nH]c(=O)c1O)-c1sccc1NC(=O)Cc1c[nH]c2ccccc12
InChI Key InChIKey=YIEUMZYLFQYCPH-UHFFFAOYSA-N
Data  1 IC50
  Tab Delimited (TSV)   2D SDfile   Computed 3D by Vconf -m prep SDfile
Find this compound or compounds like it in BindingDB:
Activity Spreadsheet -- Enzyme Inhibition Constant Data from BindingDB
Found 1 hit for monomerid = 50183496
TargetRNA-directed RNA polymerase(Hepatitis C virus)
P. Angeletti S.P.A. (Merck Research Laboratories)
Curated by ChEMBL
LigandPNGBDBM50183496(5,6-dihydroxy-2-{3-[(1H-indol-3-ylacetyl)amino]-2-...)
Affinity DataIC50:  200nM. Assay description: Inhibitory activity against HCV 1b BK NS5B deltaC55 RNA polymerase
In DepthDetails ArticlePubMed