BDBM50183497 5,6-dihydroxy-2-(3-{[(1-naphthylmethoxy)carbonyl]amino}-2-thienyl)pyrimidine-4-carboxylic acid::CHEMBL377504
SMILES OC(=O)c1nc([nH]c(=O)c1O)-c1sccc1NC(=O)OCc1cccc2ccccc12
InChI Key InChIKey=NTOYGPPDORIXJW-UHFFFAOYSA-N
Data  1 EC50
  Tab Delimited (TSV)   2D SDfile   Computed 3D by Vconf -m prep SDfile
Find this compound or compounds like it in BindingDB:
Activity Spreadsheet -- Enzyme Inhibition Constant Data from BindingDB
Found 1 hit for monomerid = 50183497
TargetRNA-directed RNA polymerase(Hepatitis C virus)
P. Angeletti S.P.A. (Merck Research Laboratories)
Curated by ChEMBL
LigandPNGBDBM50183497(5,6-dihydroxy-2-(3-{[(1-naphthylmethoxy)carbonyl]a...)
Affinity DataEC50:  1.36E+4nM. Assay description: Inhibitory activity against HCV 1b BK NS5B deltaC55 RNA polymerase
In DepthDetails ArticlePubMed