BDBM50183501 5,6-dihydroxy-2-(3-methyl-2-thienyl)pyrimidine-4-carboxylic acid::CHEMBL379015
SMILES Cc1ccsc1-c1nc(C(O)=O)c(O)c(=O)[nH]1
InChI Key InChIKey=FQFOFBNCKZEOCQ-UHFFFAOYSA-N
Data  2 IC50
  Tab Delimited (TSV)   2D SDfile   Computed 3D by Vconf -m prep SDfile
Find this compound or compounds like it in BindingDB:
Activity Spreadsheet -- Enzyme Inhibition Constant Data from BindingDB
Found 2 hits for monomerid = 50183501
TargetTripartite terminase subunit 3(Human cytomegalovirus (strain AD169) (HHV-5) (Huma...)
University Of Minnesota
Curated by ChEMBL
LigandPNGBDBM50183501(5,6-dihydroxy-2-(3-methyl-2-thienyl)pyrimidine-4-c...)
Affinity DataIC50:  1.40E+3nM. Assay description: Inhibition of human cytomegalovirus pHAR-UL89C expressed in Escherichia coli Rosette using Digoxigenin-labeled 5'-taatcgccttgcagcacatccccattcgccagctg...
In DepthDetails PubMed
TargetRNA-directed RNA polymerase(Hepatitis C virus)
P. Angeletti S.P.A. (Merck Research Laboratories)
Curated by ChEMBL
LigandPNGBDBM50183501(5,6-dihydroxy-2-(3-methyl-2-thienyl)pyrimidine-4-c...)
Affinity DataIC50:  5.60E+3nM. Assay description: Inhibitory activity against HCV 1b BK NS5B deltaC55 RNA polymerase
In DepthDetails ArticlePubMed