BDBM50183521 4-[3-(2-furan-2-yl-8-methy-8H-pyrazolo[4,3-e][1,2,4]triazolo-[1,5-c]pyrimidin-5-yl)-ureido]-N-methylpyridinium iodide::CHEMBL204128
SMILES Cn1cc2c(n1)nc(NC(=O)[NH+]=c1ccn(C)cc1)n1nc(nc21)-c1ccco1
InChI Key InChIKey=UXJHAMOXJAPCKE-UHFFFAOYSA-O
Data  3 KI  1 IC50
  Tab Delimited (TSV)   2D SDfile   Computed 3D by Vconf -m prep SDfile
Find this compound or compounds like it in BindingDB:
Activity Spreadsheet -- Enzyme Inhibition Constant Data from BindingDB
Found 4 hits for monomerid = 50183521
TargetAdenosine receptor A3(Homo sapiens (Human))
Universit£
Curated by ChEMBL
LigandPNGBDBM50183521(4-[3-(2-furan-2-yl-8-methy-8H-pyrazolo[4,3-e][1,2,...)
Affinity DataKi:  28nM. Assay description: Displacement of [3H]MRE3008-F20 from human adenosine A3 receptor expressed in HEK293 cells
In DepthDetails ArticlePubMed
TargetAdenosine receptor A2a(Homo sapiens (Human))
Universit£
Curated by ChEMBL
LigandPNGBDBM50183521(4-[3-(2-furan-2-yl-8-methy-8H-pyrazolo[4,3-e][1,2,...)
Affinity DataKi:  282nM. Assay description: Displacement of [3H]ZM-241385 from human adenosine A2A receptor expressed in HEK293 cells
In DepthDetails ArticlePubMed
TargetAdenosine receptor A1(Homo sapiens (Human))
Universit£
Curated by ChEMBL
LigandPNGBDBM50183521(4-[3-(2-furan-2-yl-8-methy-8H-pyrazolo[4,3-e][1,2,...)
Affinity DataKi: >1.00E+3nM. Assay description: Displacement of [3H]DPCPX from human adenosine A1 receptor expressed in CHO cells
In DepthDetails ArticlePubMed
TargetAdenosine receptor A2b(Homo sapiens (Human))
Universit£
Curated by ChEMBL
LigandPNGBDBM50183521(4-[3-(2-furan-2-yl-8-methy-8H-pyrazolo[4,3-e][1,2,...)
Affinity DataIC50: >1.00E+3nM. Assay description: Inhibition of NECA-stimulated cAMP accumulation in CHO cells expressing human adenosine A2B receptor
In DepthDetails ArticlePubMed