BDBM50183728 CHEMBL207075::N-(4-(2-(hydroxyamino)-2-oxoethyl)-1-phenylpiperidin-4-yl)-4-((2-methylquinolin-4-yl)methoxy)benzamide
SMILES Cc1cc(COc2ccc(cc2)C(=O)NC2(CC(=O)NO)CCN(CC2)c2ccccc2)c2ccccc2n1
InChI Key InChIKey=FAKDVMIECOUVIL-UHFFFAOYSA-N
Data  4 KI  1 IC50
  Tab Delimited (TSV)   2D SDfile   Computed 3D by Vconf -m prep SDfile
Find this compound or compounds like it in BindingDB:
Activity Spreadsheet -- Enzyme Inhibition Constant Data from BindingDB
Found 5 hits for monomerid = 50183728
TargetMatrix metalloproteinase-9(Homo sapiens (Human))
Bristol-Myers Squibb Pharmaceutical Research Institute
Curated by ChEMBL
LigandPNGBDBM50183728(CHEMBL207075 | N-(4-(2-(hydroxyamino)-2-oxoethyl)-...)
Affinity DataKi: >2.13E+3nM. Assay description: Binding affinity to MMP9
In DepthDetails ArticlePubMed
Target72 kDa type IV collagenase(Homo sapiens (Human))
Bristol-Myers Squibb Pharmaceutical Research Institute
Curated by ChEMBL
LigandPNGBDBM50183728(CHEMBL207075 | N-(4-(2-(hydroxyamino)-2-oxoethyl)-...)
Affinity DataKi: >3.33E+3nM. Assay description: Binding affinity to MMP2
In DepthDetails ArticlePubMed
TargetInterstitial collagenase(Homo sapiens (Human))
Bristol-Myers Squibb Pharmaceutical Research Institute
Curated by ChEMBL
LigandPNGBDBM50183728(CHEMBL207075 | N-(4-(2-(hydroxyamino)-2-oxoethyl)-...)
Affinity DataKi: >4.95E+3nM. Assay description: Binding affinity to MMP1
In DepthDetails ArticlePubMed
TargetCollagenase 3(Homo sapiens (Human))
Bristol-Myers Squibb Pharmaceutical Research Institute
Curated by ChEMBL
LigandPNGBDBM50183728(CHEMBL207075 | N-(4-(2-(hydroxyamino)-2-oxoethyl)-...)
Affinity DataKi: >5.03E+3nM. Assay description: Binding affinity to MMP13
In DepthDetails ArticlePubMed
TargetDisintegrin and metalloproteinase domain-containing protein 17(Sus scrofa (pig))
Bristol-Myers Squibb Pharmaceutical Research Institute
Curated by ChEMBL
LigandPNGBDBM50183728(CHEMBL207075 | N-(4-(2-(hydroxyamino)-2-oxoethyl)-...)
Affinity DataIC50:  1.90nM. Assay description: Inhibition of porcine TACE
In DepthDetails ArticlePubMed