BDBM50183910 4-(2-(4-fluorophenyl)-5-(pyrrolidin-2-yl)-1H-pyrrol-3-yl)pyridine::CHEMBL382249
SMILES Fc1ccc(cc1)-c1[nH]c(cc1-c1ccncc1)C1CCCN1
InChI Key InChIKey=OVWROQWOGCKOHZ-UHFFFAOYSA-N
Data  1 IC50
  Tab Delimited (TSV)   2D SDfile   Computed 3D by Vconf -m prep SDfile
Find this compound or compounds like it in BindingDB:
Activity Spreadsheet -- Enzyme Inhibition Constant Data from BindingDB
Found 1 hit for monomerid = 50183910
TargetcGMP-dependent protein kinase(Eimeria tenella)
Merck Research Laboratories
Curated by ChEMBL
LigandPNGBDBM50183910(4-(2-(4-fluorophenyl)-5-(pyrrolidin-2-yl)-1H-pyrro...)
Affinity DataIC50:  3.10nM. Assay description: Inhibition of Eimeria tenella PKG
In DepthDetails ArticlePubMed