BDBM50183920 (2S)-1-(2-(5-(4-fluorophenyl)-4-(pyridin-4-yl)-1H-pyrrol-2-yl)pyrrolidin-1-yl)propan-2-ol::CHEMBL378371
SMILES C[C@H](O)CN1CCCC1c1cc(c([nH]1)-c1ccc(F)cc1)-c1ccncc1
InChI Key InChIKey=DGAHSQWDPUWZAR-ZDGMYTEDSA-N
Data  1 IC50
  Tab Delimited (TSV)   2D SDfile   Computed 3D by Vconf -m prep SDfile
Find this compound or compounds like it in BindingDB:
Activity Spreadsheet -- Enzyme Inhibition Constant Data from BindingDB
Found 1 hit for monomerid = 50183920
TargetcGMP-dependent protein kinase(Eimeria tenella)
Merck Research Laboratories
Curated by ChEMBL
LigandPNGBDBM50183920((2S)-1-(2-(5-(4-fluorophenyl)-4-(pyridin-4-yl)-1H-...)
Affinity DataIC50:  2.80nM. Assay description: Inhibition of Eimeria tenella PKG
In DepthDetails ArticlePubMed