BDBM50184049 3-(6-(2-(3,4,5-trimethoxyphenylamino)-7H-pyrrolo[2,3-d]pyrimidin-7-yl)pyridin-2-yl)propanoic acid::CHEMBL207491
SMILES COc1cc(Nc2ncc3ccn(-c4cccc(CCC(O)=O)n4)c3n2)cc(OC)c1OC
InChI Key InChIKey=IXUQRSPUDDOQPA-UHFFFAOYSA-N
Data  2 IC50
  Tab Delimited (TSV)   2D SDfile   Computed 3D by Vconf -m prep SDfile
Find this compound or compounds like it in BindingDB:
Activity Spreadsheet -- Enzyme Inhibition Constant Data from BindingDB
Found 2 hits for monomerid = 50184049
TargetFocal adhesion kinase 1(Homo sapiens (Human))
Dana-Farber Cancer Institute
Curated by ChEMBL
LigandPNGBDBM50184049(3-(6-(2-(3,4,5-trimethoxyphenylamino)-7H-pyrrolo[2...)
Affinity DataIC50:  4nM. Assay description: Inhibition of FAK (31-686) (unknown origin) using 32P-ATP after 2 hrs incubation measured by scintillation counting
In DepthDetails ArticlePubMed
TargetFocal adhesion kinase 1(Homo sapiens (Human))
Dana-Farber Cancer Institute
Curated by ChEMBL
LigandPNGBDBM50184049(3-(6-(2-(3,4,5-trimethoxyphenylamino)-7H-pyrrolo[2...)
Affinity DataIC50:  4nM. Assay description: Inhibition of FAK
In DepthDetails ArticlePubMed