BDBM50184218 2-(9-(4-chlorobenzyl)-8-(phenylsulfinyl)-2,3,4,9-tetrahydro-1H-carbazol-1-yl)acetic acid::CHEMBL378929
SMILES OC(=O)CC1CCCc2c1n(Cc1ccc(Cl)cc1)c1c(cccc21)S(=O)c1ccccc1
InChI Key InChIKey=WRMLVALLVQNILX-UHFFFAOYSA-N
Data  2 KI
  Tab Delimited (TSV)   2D SDfile   Computed 3D by Vconf -m prep SDfile
Find this compound or compounds like it in BindingDB:
Activity Spreadsheet -- Enzyme Inhibition Constant Data from BindingDB
Found 2 hits for monomerid = 50184218
TargetProstaglandin D2 receptor(Homo sapiens (Human))
Merck Frosst Canada
Curated by ChEMBL
LigandPNGBDBM50184218(2-(9-(4-chlorobenzyl)-8-(phenylsulfinyl)-2,3,4,9-t...)
Affinity DataKi:  29nM. Assay description: Binding affinity to DP receptor
In DepthDetails ArticlePubMed
TargetThromboxane A2 receptor(Homo sapiens (Human))
Merck Frosst Canada
Curated by ChEMBL
LigandPNGBDBM50184218(2-(9-(4-chlorobenzyl)-8-(phenylsulfinyl)-2,3,4,9-t...)
Affinity DataKi:  96nM. Assay description: Binding affinity to TP receptor
In DepthDetails ArticlePubMed