BDBM50184278 CHEMBL380370::N-(4-(2-amino-4-methylthiazol-5-yl)thiazol-2-yl)pyridin-2-amine
SMILES Cc1nc(N)sc1-c1csc(Nc2ccccn2)n1
InChI Key InChIKey=HCQIWJDOEHFBDB-UHFFFAOYSA-N
Data  1 IC50
  Tab Delimited (TSV)   2D SDfile   Computed 3D by Vconf -m prep SDfile
Find this compound or compounds like it in BindingDB:
Activity Spreadsheet -- Enzyme Inhibition Constant Data from BindingDB
Found 1 hit for monomerid = 50184278
TargetHeat shock protein HSP 90-alpha/90-beta(Homo sapiens (Human))
The University Of Kansas
Curated by ChEMBL
LigandPNGBDBM50184278(CHEMBL380370 | N-(4-(2-amino-4-methylthiazol-5-yl)...)
Affinity DataIC50:  7.00E+3nM. Assay description: Inhibition of Hsp90 by recombinant ATPase assay
In DepthDetails ArticlePubMed