BDBM50184280 CHEMBL385134::N-(4-hydroxy-3-methylphenyl)-3-methoxybenzamide
SMILES COc1cccc(c1)C(=O)Nc1ccc(O)c(C)c1
InChI Key InChIKey=PLQHWXJMBTWYQK-UHFFFAOYSA-N
Data  1 IC50
  Tab Delimited (TSV)   2D SDfile   Computed 3D by Vconf -m prep SDfile
Find this compound or compounds like it in BindingDB:
Activity Spreadsheet -- Enzyme Inhibition Constant Data from BindingDB
Found 1 hit for monomerid = 50184280
TargetHeat shock protein HSP 90-alpha/90-beta(Homo sapiens (Human))
The University Of Kansas
Curated by ChEMBL
LigandPNGBDBM50184280(CHEMBL385134 | N-(4-hydroxy-3-methylphenyl)-3-meth...)
Affinity DataIC50:  2.50E+3nM. Assay description: Inhibition of Hsp90 by recombinant ATPase assay
In DepthDetails ArticlePubMed