BDBM50184367 CHEMBL373774::[bis({[(2R,3S,4R,5R)-5-(2,4-dioxo-1,2,3,4-tetrahydropyrimidin-1-yl)-3,4-dihydroxyoxolan-2-yl]methyl phosphonato}oxy)phosphoryl]boranuide; tris(tributylamine)
SMILES [BH3-]P(=O)(OP([O-])(=O)OC[C@H]1O[C@H]([C@H](O)[C@@H]1O)n1ccc(=O)[nH]c1=O)OP([O-])(=O)OC[C@H]1O[C@H]([C@H](O)[C@@H]1O)n1ccc(=O)[nH]c1=O
InChI Key InChIKey=BWLUHQNHWDWKTE-NCOIDOBVSA-L
Data  1 EC50
  Tab Delimited (TSV)   2D SDfile   Computed 3D by Vconf -m prep SDfile
Find this compound or compounds like it in BindingDB:
Activity Spreadsheet -- Enzyme Inhibition Constant Data from BindingDB
Found 1 hit for monomerid = 50184367
TargetP2Y purinoceptor 1(Homo sapiens (Human))
Bar-Ilan University
Curated by ChEMBL
LigandPNGBDBM50184367(CHEMBL373774 | [bis({[(2R,3S,4R,5R)-5-(2,4-dioxo-1...)
Affinity DataEC50:  800nM. Assay description: Activity against human P2Y1-GFP expressed in 1321N1 cells by intracellular calcium increase
In DepthDetails ArticlePubMed