BDBM50184558 4-(2-(2-benzhydryl-3,5-dioxo-1,2,4-oxadiazolidin-4-yl)ethoxy)benzoic acid::CHEMBL207998
SMILES OC(=O)c1ccc(OCCn2c(=O)on(C(c3ccccc3)c3ccccc3)c2=O)cc1
InChI Key InChIKey=RIVUMQPAWWBLII-UHFFFAOYSA-N
Data  1 IC50
  Tab Delimited (TSV)   2D SDfile   Computed 3D by Vconf -m prep SDfile
Find this compound or compounds like it in BindingDB:
Activity Spreadsheet -- Enzyme Inhibition Constant Data from BindingDB
Found 1 hit for monomerid = 50184558
TargetCytosolic phospholipase A2(Homo sapiens (Human))
Wyeth Research
Curated by ChEMBL
LigandPNGBDBM50184558(4-(2-(2-benzhydryl-3,5-dioxo-1,2,4-oxadiazolidin-4...)
Affinity DataIC50: >5.00E+4nM. Assay description: Inhibition of cPLA2-alpha by GLU micelle assay
In DepthDetails ArticlePubMed