BDBM50184562 4-(2-(3-benzhydryl-2,4,6-trioxo-5-phenyl-1,3,5-triazinan-1-yl)ethoxy)benzoic acid::CHEMBL207279
SMILES OC(=O)c1ccc(OCCn2c(=O)n(C(c3ccccc3)c3ccccc3)c(=O)n(-c3ccccc3)c2=O)cc1
InChI Key InChIKey=NIPDORAGKIKKDQ-UHFFFAOYSA-N
Data  1 IC50
  Tab Delimited (TSV)   2D SDfile   Computed 3D by Vconf -m prep SDfile
Find this compound or compounds like it in BindingDB:
Activity Spreadsheet -- Enzyme Inhibition Constant Data from BindingDB
Found 1 hit for monomerid = 50184562
TargetCytosolic phospholipase A2(Homo sapiens (Human))
Wyeth Research
Curated by ChEMBL
LigandPNGBDBM50184562(4-(2-(3-benzhydryl-2,4,6-trioxo-5-phenyl-1,3,5-tri...)
Affinity DataIC50: >5.00E+4nM. Assay description: Inhibition of cPLA2-alpha by GLU micelle assay
In DepthDetails ArticlePubMed